Target
Potassium voltage-gated channel subfamily A member 1
Ligand
BDBM50149890
Substrate
Meas. Tech.
ChEMBL_1659962 (CHEMBL4009574)
IC50
30000±n/a nM
Citation
 Al-Sabi, ADaly, DHoefer, PKinsella, GKMetais, CPickering, MHerron, CKaza, SKNolan, KDolly, JO A Rational Design of a Selective Inhibitor for Kv1.1 Channels Prevalent in Demyelinated Nerves That Improves Their Impaired Axonal Conduction. J Med Chem 60:2245-2256 (2017)  
Target
Name:
Potassium voltage-gated channel subfamily A member 1
Synonyms:
KCNA1 Potassium (voltage dependent) Voltage-gated potassium channel Voltage-gated potassium channel subunit Kv1.1
Type:
Enzyme Catalytic Domain
Mol. Mass.:
56451.30
Organism:
Homo sapiens (Human)
Description:
Potassium (voltage dependent) 0 0::Q09470
Residue:
495
  
Inhibitor
Name:
BDBM50149890
Synonyms:
CHEMBL9324 | tetraethylammonium
Type:
Small organic molecule
Emp. Form.:
C8H20N
Mol. Mass.:
130.2506
SMILES:
CC[N+](CC)(CC)CC
: