Target
D(3) dopamine receptor
Ligand
BDBM50056443
Substrate
Meas. Tech.
ChEMBL_1661600 (CHEMBL4011212)
Ki
573±n/a nM
Citation
 Bonifazi, AYano, HEllenberger, MPMuller, LKumar, VZou, MFCai, NSGuerrero, AMWoods, ASShi, LNewman, AH Novel Bivalent Ligands Based on the Sumanirole Pharmacophore Reveal Dopamine D J Med Chem 60:2890-2907 (2017)  
Target
Name:
D(3) dopamine receptor
Synonyms:
DOPAMINE D3 DRD3_HUMAN Dopamine D3 receptor (D3) Dopamine receptor Dopamine receptor D3
Type:
Mol. Mass.:
44243.43
Organism:
Homo sapiens (Human)
Description:
Residue:
400
  
Inhibitor
Name:
BDBM50056443
Synonyms:
(R)-5-Methylamino-5,6-dihydro-1H,4H-imidazo[4,5,1-ij]quinolin-2-one PNU-95666E
Type:
Small organic molecule
Emp. Form.:
C11H13N3O
Mol. Mass.:
203.2404
SMILES:
CN[C@@H]1Cc2cccc3[nH]c(=O)n(C1)c23
: