Target
D(3) dopamine receptor
Ligand
BDBM50018958
Substrate
Meas. Tech.
ChEMBL_1661600 (CHEMBL4011212)
Ki
6.8±n/a nM
Citation
 Bonifazi, AYano, HEllenberger, MPMuller, LKumar, VZou, MFCai, NSGuerrero, AMWoods, ASShi, LNewman, AH Novel Bivalent Ligands Based on the Sumanirole Pharmacophore Reveal Dopamine D J Med Chem 60:2890-2907 (2017)  
Target
Name:
D(3) dopamine receptor
Synonyms:
DOPAMINE D3 DRD3_HUMAN Dopamine D3 receptor (D3) Dopamine receptor Dopamine receptor D3
Type:
Mol. Mass.:
44243.43
Organism:
Homo sapiens (Human)
Description:
Residue:
400
  
Inhibitor
Name:
BDBM50018958
Synonyms:
CHEBI:75401 | QUINPIROLE
Type:
Small organic molecule
Emp. Form.:
C13H21N3
Mol. Mass.:
219.3259
SMILES:
[H][C@]12CCCN(CCC)[C@]1([H])Cc1c[nH]nc1C2
: