Target
D(2) dopamine receptor
Ligand
BDBM50237350
Substrate
Meas. Tech.
ChEMBL_1661599 (CHEMBL4011211)
Ki
35±n/a nM
Citation
 Bonifazi, AYano, HEllenberger, MPMuller, LKumar, VZou, MFCai, NSGuerrero, AMWoods, ASShi, LNewman, AH Novel Bivalent Ligands Based on the Sumanirole Pharmacophore Reveal Dopamine D J Med Chem 60:2890-2907 (2017)  
Target
Name:
D(2) dopamine receptor
Synonyms:
D(2) dopamine receptor DOPAMINE D2 Long DRD2 Dopamine D2 receptor Dopamine D2 receptor (D2R) Dopamine2-like | d2
Type:
Cell-surface receptors
Mol. Mass.:
50647.10
Organism:
Homo sapiens (Human)
Description:
P14416
Residue:
443
  
Inhibitor
Name:
BDBM50237350
Synonyms:
CHEMBL4085282
Type:
Small organic molecule
Emp. Form.:
C27H37N3O4
Mol. Mass.:
467.6004
SMILES:
CN[C@@H]1Cc2cccc3n(CCOCCOCCOCCCCc4ccccc4)c(=O)n(C1)c23
: