Target
D(3) dopamine receptor
Ligand
BDBM50237346
Substrate
Meas. Tech.
ChEMBL_1661600 (CHEMBL4011212)
Ki
640±n/a nM
Citation
 Bonifazi, AYano, HEllenberger, MPMuller, LKumar, VZou, MFCai, NSGuerrero, AMWoods, ASShi, LNewman, AH Novel Bivalent Ligands Based on the Sumanirole Pharmacophore Reveal Dopamine D J Med Chem 60:2890-2907 (2017)  
Target
Name:
D(3) dopamine receptor
Synonyms:
DOPAMINE D3 DRD3_HUMAN Dopamine D3 receptor (D3) Dopamine receptor Dopamine receptor D3
Type:
Mol. Mass.:
44243.43
Organism:
Homo sapiens (Human)
Description:
Residue:
400
  
Inhibitor
Name:
BDBM50237346
Synonyms:
CHEMBL4095452
Type:
Small organic molecule
Emp. Form.:
C28H36N4O6
Mol. Mass.:
524.6086
SMILES:
CN[C@@H]1Cc2cccc3n(CCOCCOCCOCCOc4ccc5CCC(=O)Nc5c4)c(=O)n(C1)c23
: