Target
D(3) dopamine receptor
Ligand
BDBM50237344
Substrate
Meas. Tech.
ChEMBL_1661600 (CHEMBL4011212)
Ki
84±n/a nM
Citation
 Bonifazi, AYano, HEllenberger, MPMuller, LKumar, VZou, MFCai, NSGuerrero, AMWoods, ASShi, LNewman, AH Novel Bivalent Ligands Based on the Sumanirole Pharmacophore Reveal Dopamine D J Med Chem 60:2890-2907 (2017)  
Target
Name:
D(3) dopamine receptor
Synonyms:
DOPAMINE D3 DRD3_HUMAN Dopamine D3 receptor (D3) Dopamine receptor Dopamine receptor D3
Type:
Mol. Mass.:
44243.43
Organism:
Homo sapiens (Human)
Description:
Residue:
400
  
Inhibitor
Name:
BDBM50237344
Synonyms:
CHEMBL4068455
Type:
Small organic molecule
Emp. Form.:
C29H37N5O2
Mol. Mass.:
487.6364
SMILES:
CCCN(CCC)[C@@H]1Cc2cccc3n(CCCCNC(=O)c4cc5ccccc5[nH]4)c(=O)n(C1)c23
: