Target
D(3) dopamine receptor
Ligand
BDBM50237354
Substrate
Meas. Tech.
ChEMBL_1661600 (CHEMBL4011212)
Ki
141±n/a nM
Citation
 Bonifazi, AYano, HEllenberger, MPMuller, LKumar, VZou, MFCai, NSGuerrero, AMWoods, ASShi, LNewman, AH Novel Bivalent Ligands Based on the Sumanirole Pharmacophore Reveal Dopamine D J Med Chem 60:2890-2907 (2017)  
Target
Name:
D(3) dopamine receptor
Synonyms:
DOPAMINE D3 DRD3_HUMAN Dopamine D3 receptor (D3) Dopamine receptor Dopamine receptor D3
Type:
Mol. Mass.:
44243.43
Organism:
Homo sapiens (Human)
Description:
Residue:
400
  
Inhibitor
Name:
BDBM50237354
Synonyms:
CHEMBL4086953
Type:
Small organic molecule
Emp. Form.:
C33H49N3O2
Mol. Mass.:
519.7611
SMILES:
CN[C@@H]1Cc2cccc3n(CCCCCCCCCCCCOCCCCc4ccccc4)c(=O)n(C1)c23
: