Target
D(2) dopamine receptor
Ligand
BDBM50237342
Substrate
Meas. Tech.
ChEMBL_1661616 (CHEMBL4011228)
IC50
802±n/a nM
Citation
 Bonifazi, AYano, HEllenberger, MPMuller, LKumar, VZou, MFCai, NSGuerrero, AMWoods, ASShi, LNewman, AH Novel Bivalent Ligands Based on the Sumanirole Pharmacophore Reveal Dopamine D J Med Chem 60:2890-2907 (2017)  
Target
Name:
D(2) dopamine receptor
Synonyms:
D(2) dopamine receptor DOPAMINE D2 Long DRD2 Dopamine D2 receptor Dopamine D2 receptor (D2R) Dopamine2-like | d2
Type:
Cell-surface receptors
Mol. Mass.:
50647.10
Organism:
Homo sapiens (Human)
Description:
P14416
Residue:
443
  
Inhibitor
Name:
BDBM50237342
Synonyms:
CHEMBL4076129
Type:
Small organic molecule
Emp. Form.:
C31H45N3O2
Mol. Mass.:
491.7079
SMILES:
CN[C@@H]1Cc2cccc3n(CCCCCCCCCCOCCCCc4ccccc4)c(=O)n(C1)c23
: