Target
D(3) dopamine receptor
Ligand
BDBM55121
Substrate
Meas. Tech.
ChEMBL_1661600 (CHEMBL4011212)
Ki
3.0±n/a nM
Citation
 Bonifazi, AYano, HEllenberger, MPMuller, LKumar, VZou, MFCai, NSGuerrero, AMWoods, ASShi, LNewman, AH Novel Bivalent Ligands Based on the Sumanirole Pharmacophore Reveal Dopamine D J Med Chem 60:2890-2907 (2017)  
Target
Name:
D(3) dopamine receptor
Synonyms:
DOPAMINE D3 DRD3_HUMAN Dopamine D3 receptor (D3) Dopamine receptor Dopamine receptor D3
Type:
Mol. Mass.:
44243.43
Organism:
Homo sapiens (Human)
Description:
Residue:
400
  
Inhibitor
Name:
BDBM55121
Synonyms:
3-HYDROXYTYRAMINE HYDROCHLORIDE 4-(2-aminoethyl)pyrocatechol;hydrochloride Dopamine SMR000059081 | cid_65340
Type:
Small organic molecule
Emp. Form.:
C8H11NO2
Mol. Mass.:
153.1784
SMILES:
NCCc1ccc(O)c(O)c1
: