Target
P2Y purinoceptor 4
Ligand
BDBM50268685
Substrate
Meas. Tech.
ChEBML_1661636
IC50
6100±n/a nM
Citation
 Rafehi, MMalik, EMNeumann, AAbdelrahman, AHanck, TNamasivayam, VMüller, CEBaqi, Y Development of Potent and Selective Antagonists for the UTP-Activated P2Y J Med Chem 60:3020-3038 (2017)  
Target
Name:
P2Y purinoceptor 4
Synonyms:
NRU P2RY4 P2Y purinoceptor 4 Pyrimidinergic receptor P2Y4 Uridine nucleotide receptor
Type:
PROTEIN
Mol. Mass.:
40977.17
Organism:
Homo sapiens (Human)
Description:
ChEMBL_751027
Residue:
365
  
Inhibitor
Name:
BDBM50268685
Synonyms:
CHEMBL524064 | sodium 1-amino-4-(2-carboxyphenylamino)-9,10-dioxo-9,10-dihydroanthracene-2-sulfonate
Type:
Small organic molecule
Emp. Form.:
C21H13N2O7S
Mol. Mass.:
437.403
SMILES:
Nc1c(cc(Nc2ccccc2C(O)=O)c2C(=O)c3ccccc3C(=O)c12)S([O-])(=O)=O
: