Target
P2Y purinoceptor 4
Ligand
BDBM50237558
Substrate
Meas. Tech.
ChEBML_1661636
IC50
6450±n/a nM
Citation
 Rafehi, MMalik, EMNeumann, AAbdelrahman, AHanck, TNamasivayam, VMüller, CEBaqi, Y Development of Potent and Selective Antagonists for the UTP-Activated P2Y J Med Chem 60:3020-3038 (2017)  
Target
Name:
P2Y purinoceptor 4
Synonyms:
NRU P2RY4 P2Y purinoceptor 4 Pyrimidinergic receptor P2Y4 Uridine nucleotide receptor
Type:
PROTEIN
Mol. Mass.:
40977.17
Organism:
Homo sapiens (Human)
Description:
ChEMBL_751027
Residue:
365
  
Inhibitor
Name:
BDBM50237558
Synonyms:
CHEMBL1671994
Type:
Small organic molecule
Emp. Form.:
C22H17N2NaO5S
Mol. Mass.:
444.436
SMILES:
[Na+].Cc1cc(C)cc(Nc2cc(c(N)c3C(=O)c4ccccc4C(=O)c23)S([O-])(=O)=O)c1
: