Target
Kappa-type opioid receptor
Ligand
BDBM50237595
Substrate
Meas. Tech.
ChEMBL_1661666 (CHEMBL4011278)
Ki
519±n/a nM
Citation
 Adamska-Bartlomiejczyk, AJanecka, ASzabó, MRCerlesi, MCCalo, GKluczyk, ATömböly, CBorics, A Cyclic mu-opioid receptor ligands containing multiple N-methylated amino acid residues. Bioorg Med Chem Lett 27:1644-1648 (2017)  
Target
Name:
Kappa-type opioid receptor
Synonyms:
Kappa Opioid Receptor OPRK1 Opiate Kappa 1 | mu/kappa opioid receptor
Type:
G Protein-Coupled Receptor (GPCR)
Mol. Mass.:
42744.99
Organism:
Cavia porcellus (domestic guinea pig)
Description:
P41144
Residue:
380
  
Inhibitor
Name:
BDBM50237595
Synonyms:
CHEMBL4065881
Type:
Small organic molecule
Emp. Form.:
C42H54N8O8
Mol. Mass.:
798.927
SMILES:
CN[C@H](Cc1ccc(O)cc1)C(=O)N[C@H]1CCCCNC(=O)C[C@H](NC(=O)[C@H](Cc2ccccc2)N(C)C(=O)CNC(=O)[C@H](Cc2ccccc2)N(C)C1=O)C(N)=O
: