Target
Delta-type opioid receptor
Ligand
BDBM50237595
Substrate
Meas. Tech.
ChEMBL_1661665 (CHEMBL4011277)
Ki
>1000±n/a nM
Citation
 Adamska-Bartlomiejczyk, AJanecka, ASzabó, MRCerlesi, MCCalo, GKluczyk, ATömböly, CBorics, A Cyclic mu-opioid receptor ligands containing multiple N-methylated amino acid residues. Bioorg Med Chem Lett 27:1644-1648 (2017)  
Target
Name:
Delta-type opioid receptor
Synonyms:
Cytochrome P450 3A4 Delta opioid receptor Delta-type opioid receptor (DOR) OPRD_RAT Opioid receptor Opioid receptors; mu & delta Ror-a | Voltage-gated potassium channel
Type:
G Protein-Coupled Receptor (GPCR)
Mol. Mass.:
40465.04
Organism:
Rattus norvegicus (rat)
Description:
Competition binding assays were using CHO-K1 cell membranes expressing the opioid receptor.
Residue:
372
  
Inhibitor
Name:
BDBM50237595
Synonyms:
CHEMBL4065881
Type:
Small organic molecule
Emp. Form.:
C42H54N8O8
Mol. Mass.:
798.927
SMILES:
CN[C@H](Cc1ccc(O)cc1)C(=O)N[C@H]1CCCCNC(=O)C[C@H](NC(=O)[C@H](Cc2ccccc2)N(C)C(=O)CNC(=O)[C@H](Cc2ccccc2)N(C)C1=O)C(N)=O
: