Target
Bile salt export pump
Ligand
BDBM50165019
Substrate
Meas. Tech.
ChEBML_1661982
IC50
27400±n/a nM
Citation
 Morgan, RETrauner, Mvan Staden, CJLee, PHRamachandran, BEschenberg, MAfshari, CAQualls, CWLightfoot-Dunn, RHamadeh, HK Interference with bile salt export pump function is a susceptibility factor for human liver injury in drug development. Toxicol Sci 118:485-500 (2010)  
Target
Name:
Bile salt export pump
Synonyms:
ABCB11 ATP-binding cassette sub-family B member 11 Bile Salt Export Pump, BSEP Bile salt export pump (BSEP)
Type:
Protein
Mol. Mass.:
146405.49
Organism:
Homo sapiens (Human)
Description:
O95342
Residue:
1321
  
Inhibitor
Name:
BDBM50165019
Synonyms:
4-(Diethylamino)-2-butynyl alpha-phenylcyclohexaneglycolic acid ester 4-Diethylamino-2-butinyl alpha-cyclohexylmandelat Benzeneacetic acid, alpha-cyclohexyl-alpha-hydroxy-, 4-(diethylamino)-2-butynyl ester Cyclohexaneglycolic acid, alpha-phenyl-, 4-(diethylamino)-2-butynyl ester | OXYBUTYNIN CHLORIDE
Type:
Small organic molecule
Emp. Form.:
C22H31NO3
Mol. Mass.:
357.4864
SMILES:
CCN(CC)CC#CCOC(=O)C(O)(C1CCCCC1)c1ccccc1
: