Target
Amine oxidase [flavin-containing] B
Ligand
BDBM10989
Substrate
Meas. Tech.
ChEMBL_1662068 (CHEMBL4011749)
IC50
14±n/a nM
Citation
 Lee, JLee, YPark, SJLee, JKim, YSSuh, YGLee, J Discovery of highly selective and potent monoamine oxidase B inhibitors: Contribution of additional phenyl rings introduced into 2-aryl-1,3,4-oxadiazin-5(6H)-one. Eur J Med Chem 130:365-378 (2017)  
Target
Name:
Amine oxidase [flavin-containing] B
Synonyms:
AOFB_HUMAN MAOB Monoamine oxidase type B (MAO B) Monoamine oxidase type B (MAOB)
Type:
Protein
Mol. Mass.:
58768.76
Organism:
Homo sapiens (Human)
Description:
P27338
Residue:
520
  
Inhibitor
Name:
BDBM10989
Synonyms:
(1R)-N-(prop-2-yn-1-yl)-2,3-dihydro-1H-inden-1-amine Rasagiline | US9034303, Rasagiline
Type:
Small organic molecule
Emp. Form.:
C12H13N
Mol. Mass.:
171.2383
SMILES:
C#CCN[C@@H]1CCc2ccccc12
: