Target
Cytochrome P450 11B2, mitochondrial
Ligand
BDBM50238105
Substrate
Meas. Tech.
ChEBML_1662805
IC50
300±n/a nM
Citation
 Meguro, MMiyauchi, SKanao, YNaito, SSuzuki, KInoue, SYamada, KHomma, TChiba, KNara, FFuruzono, S 4-Anilino-pyrimidine, novel aldosterone synthase (CYP11B2) inhibitors bearing pyrimidine structures. Bioorg Med Chem Lett 27:1902-1906 (2017)  
Target
Name:
Cytochrome P450 11B2, mitochondrial
Synonyms:
Aldosterone synthase CYPXIB2 Cyp11b2 Cytochrome P450 11B2 P450-Aldo-1 | Steroid 11-beta-hydroxylase
Type:
PROTEIN
Mol. Mass.:
58260.64
Organism:
Rattus norvegicus
Description:
ChEMBL_224979
Residue:
510
  
Inhibitor
Name:
BDBM50238105
Synonyms:
CHEMBL4099824
Type:
Small organic molecule
Emp. Form.:
C17H21FN4O3S
Mol. Mass.:
380.437
SMILES:
CS(=O)(=O)N1CCC(CC1)C(O)c1cncnc1Nc1ccc(F)cc1
: