Target
Dual specificity protein kinase CLK1
Ligand
BDBM50238866
Substrate
Meas. Tech.
ChEMBL_1664430 (CHEMBL4014111)
IC50
139±n/a nM
Citation
 Sun, QZSun, QZLin, GFLin, GFLi, LLLi, LLJin, XTJin, XTHuang, LYHuang, LYZhang, GZhang, GYang, WYang, WChen, KChen, KXiang, RXiang, RChen, CChen, CWei, YQWei, YQLu, GWLu, GWYang, SYYang, SY Discovery of Potent and Selective Inhibitors of Cdc2-Like Kinase 1 (CLK1) as a New Class of Autophagy Inducers. J Med Chem 60:6337-6352 (2017)  
Target
Name:
Dual specificity protein kinase CLK1
Synonyms:
CDC-like kinase 1 CDC2-like kinase 1 (CLK1) CLK1 Dual specificity protein kinase CLK1 Dual specificty protein kinase CLK1
Type:
Protein
Mol. Mass.:
57322.21
Organism:
Homo sapiens (Human)
Description:
P49759
Residue:
484
  
Inhibitor
Name:
BDBM50238866
Synonyms:
CHEMBL4079878
Type:
Small organic molecule
Emp. Form.:
C16H13N5
Mol. Mass.:
275.3079
SMILES:
Cc1cc(ccn1)-c1ccc2ncc3nnn(C)c3c2c1
: