Target
Dual specificity protein kinase CLK1
Ligand
BDBM50026622
Substrate
Meas. Tech.
ChEMBL_1664430 (CHEMBL4014111)
IC50
17±n/a nM
Citation
 Sun, QZSun, QZLin, GFLin, GFLi, LLLi, LLJin, XTJin, XTHuang, LYHuang, LYZhang, GZhang, GYang, WYang, WChen, KChen, KXiang, RXiang, RChen, CChen, CWei, YQWei, YQLu, GWLu, GWYang, SYYang, SY Discovery of Potent and Selective Inhibitors of Cdc2-Like Kinase 1 (CLK1) as a New Class of Autophagy Inducers. J Med Chem 60:6337-6352 (2017)  
Target
Name:
Dual specificity protein kinase CLK1
Synonyms:
CDC-like kinase 1 CDC2-like kinase 1 (CLK1) CLK1 Dual specificity protein kinase CLK1 Dual specificty protein kinase CLK1
Type:
Protein
Mol. Mass.:
57322.21
Organism:
Homo sapiens (Human)
Description:
P49759
Residue:
484
  
Inhibitor
Name:
BDBM50026622
Synonyms:
CHEMBL408982
Type:
Small organic molecule
Emp. Form.:
C13H15NO2S
Mol. Mass.:
249.329
SMILES:
CCN1\C(Sc2ccc(OC)cc12)=C\C(C)=O
: