Target
Dual specificity tyrosine-phosphorylation-regulated kinase 1A
Ligand
BDBM50238890
Substrate
Meas. Tech.
ChEMBL_1664431 (CHEMBL4014112)
IC50
2872±n/a nM
Citation
 Sun, QZSun, QZLin, GFLin, GFLi, LLLi, LLJin, XTJin, XTHuang, LYHuang, LYZhang, GZhang, GYang, WYang, WChen, KChen, KXiang, RXiang, RChen, CChen, CWei, YQWei, YQLu, GWLu, GWYang, SYYang, SY Discovery of Potent and Selective Inhibitors of Cdc2-Like Kinase 1 (CLK1) as a New Class of Autophagy Inducers. J Med Chem 60:6337-6352 (2017)  
Target
Name:
Dual specificity tyrosine-phosphorylation-regulated kinase 1A
Synonyms:
DYR1A_HUMAN DYRK1A Dual specificity YAK1-related kinase 1A (Dyrk1A) Dual-specificity tyrosine-phosphorylation regulated kinase 1A HP86 MNBH
Type:
Enzyme
Mol. Mass.:
85616.61
Organism:
Homo sapiens (Human)
Description:
Q13627
Residue:
763
  
Inhibitor
Name:
BDBM50238890
Synonyms:
CHEMBL4092984
Type:
Small organic molecule
Emp. Form.:
C23H18FN5O
Mol. Mass.:
399.4203
SMILES:
COc1cc(ccn1)-c1ccc2ncc3nnn([C@@H](C)c4ccc(F)cc4)c3c2c1
: