Target
Dual specificity protein kinase CLK1
Ligand
BDBM50238879
Substrate
Meas. Tech.
ChEMBL_1664430 (CHEMBL4014111)
IC50
155±n/a nM
Citation
 Sun, QZSun, QZLin, GFLin, GFLi, LLLi, LLJin, XTJin, XTHuang, LYHuang, LYZhang, GZhang, GYang, WYang, WChen, KChen, KXiang, RXiang, RChen, CChen, CWei, YQWei, YQLu, GWLu, GWYang, SYYang, SY Discovery of Potent and Selective Inhibitors of Cdc2-Like Kinase 1 (CLK1) as a New Class of Autophagy Inducers. J Med Chem 60:6337-6352 (2017)  
Target
Name:
Dual specificity protein kinase CLK1
Synonyms:
CDC-like kinase 1 CDC2-like kinase 1 (CLK1) CLK1 Dual specificity protein kinase CLK1 Dual specificty protein kinase CLK1
Type:
Protein
Mol. Mass.:
57322.21
Organism:
Homo sapiens (Human)
Description:
P49759
Residue:
484
  
Inhibitor
Name:
BDBM50238879
Synonyms:
CHEMBL4064426
Type:
Small organic molecule
Emp. Form.:
C23H18ClN5
Mol. Mass.:
399.876
SMILES:
C[C@@H](c1ccc(Cl)cc1)n1nnc2cnc3ccc(cc3c12)-c1ccnc(C)c1
: