Target
Casein kinase I isoform delta
Ligand
BDBM274595
Substrate
Meas. Tech.
Kinase Assay
pH
7.4±n/a
Temperature
298.15±n/a K
IC50
0.110±n/a nM
Comments
extracted
Citation
 Velaparthi, UDarne, CPDodd, DSSampognaro, AJWittman, MDKumaravel, SMullick, DLiu, PRachamreddy, CR Substituted imidazoles as casein kinase 1 D/E inhibitors US Patent  US9556179 Publication Date 1/31/2017 
Target
Name:
Casein kinase I isoform delta
Synonyms:
CKI-delta CSNK1D Casein kinase I delta Casein kinase I isoform delta (CK1D) KC1D_HUMAN | casein kinases 1 delta (CK1 delta)
Type:
Enzyme
Mol. Mass.:
47356.76
Organism:
Homo sapiens (Human)
Description:
P48730
Residue:
415
  
Inhibitor
Name:
BDBM274595
Synonyms:
N-(6-(4-(4-fluorophenyl)-1- (2-morpholinoethyl)-1H- imidazol-5-yl)imidazo[1,2-b] pyridazin-2-yl)-2- morpholinoisonicotinamide | US9556179, Compound 168
Type:
Small organic molecule
Emp. Form.:
C36H41FN10O3
Mol. Mass.:
680.7743
SMILES:
Fc1ccc(cc1)-c1ncn(C2CCN(CCN3CCOCC3)CC2)c1-c1ccc2nc(NC(=O)c3ccnc(c3)N3CCOCC3)cn2n1
: