Target
Casein kinase I isoform delta
Ligand
BDBM274619
Substrate
Meas. Tech.
Kinase Assay
pH
7.4±n/a
Temperature
298.15±n/a K
IC50
0.111±n/a nM
Comments
extracted
Citation
 Velaparthi, UDarne, CPDodd, DSSampognaro, AJWittman, MDKumaravel, SMullick, DLiu, PRachamreddy, CR Substituted imidazoles as casein kinase 1 D/E inhibitors US Patent  US9556179 Publication Date 1/31/2017 
Target
Name:
Casein kinase I isoform delta
Synonyms:
CKI-delta CSNK1D Casein kinase I delta Casein kinase I isoform delta (CK1D) KC1D_HUMAN | casein kinases 1 delta (CK1 delta)
Type:
Enzyme
Mol. Mass.:
47356.76
Organism:
Homo sapiens (Human)
Description:
P48730
Residue:
415
  
Inhibitor
Name:
BDBM274619
Synonyms:
2-(dimethylamino)-N-(6-(2-(4- fluorophenyl)imidazo[1,2-a] pyridin-3-yl)imidazo[1,2-b] pyridazin-2-yl) isonicotinamide | US9556179, Compound 193
Type:
Small organic molecule
Emp. Form.:
C27H21FN8O
Mol. Mass.:
492.507
SMILES:
CN(C)c1cc(ccn1)C(=O)Nc1cn2nc(ccc2n1)-c1c(nc2ccccn12)-c1ccc(F)cc1
: