Target
Substance-P receptor
Ligand
BDBM50030178
Substrate
Ki
1.49±n/a nM
Comments
PDSP_824
Citation
 Kudlacz, EMShatzer, SAKnippenberg, RWLogan, DEPoirot, Mvan Giersbergen, PLBurkholder, TP In vitro and in vivo characterization of MDL 105,212A, a nonpeptide NK-1/NK-2 tachykinin receptor antagonist. J Pharmacol Exp Ther 277:840-51 (1996) Target
Name:
Substance-P receptor
Synonyms:
NK-1 receptor NK1 Receptor NK1R_HUMAN Neurokinin-1 (NK-1) SPR TACR1 Tachykinin receptor 1 (NK1) | tachykinin
Type:
G Protein-Coupled Receptor (GPCR)
Mol. Mass.:
46254.43
Organism:
Homo sapiens (Human)
Description:
P25103
Residue:
407
  
Inhibitor
Name:
BDBM50030178
Synonyms:
(R)-4-Hydroxy-1-(1-methyl-1H-indole-3-carbonyl)-pyrrolidine-2-carboxylic acid [(R)-1-(benzyl-methyl-carbamoyl)-2-naphthalen-2-yl-ethyl]-amide FK 888
Type:
Small organic molecule
Emp. Form.:
C36H36N4O4
Mol. Mass.:
588.6954
SMILES:
CN(Cc1ccccc1)C(=O)[C@@H](Cc1ccc2ccccc2c1)NC(=O)C1C[C@@H](O)CN1C(=O)c1cn(C)c2ccccc12
: