Target
5-hydroxytryptamine receptor 2B
Ligand
BDBM50004327
Substrate
Ki
4700±n/a nM
Comments
PDSP_1177
Citation
 Wainscott, DBLucaites, VLKursar, JDBaez, MNelson, DL Pharmacologic characterization of the human 5-hydroxytryptamine2B receptor: evidence for species differences. J Pharmacol Exp Ther 276:720-7 (1996) Target
Name:
5-hydroxytryptamine receptor 2B
Synonyms:
5-HT2B 5HT2B_RAT Serotonin 2b (5-HT2b) receptor Srl
Type:
Enzyme Catalytic Domain
Mol. Mass.:
53668.47
Organism:
RAT
Description:
5-HT2B HTR2B RAT::P30994
Residue:
479
  
Inhibitor
Name:
BDBM50004327
Synonyms:
(1-Phenethyl-piperidin-4-yl)-phenyl-methanol Glemanserin MDL-11939
Type:
Small organic molecule
Emp. Form.:
C20H25NO
Mol. Mass.:
295.4186
SMILES:
OC(C1CCN(CCc2ccccc2)CC1)c1ccccc1
: