Target
Gamma-aminobutyric acid receptor subunit alpha-4
Ligand
BDBM50017320
Substrate
Ki
53.45±n/a nM
Comments
PDSP_415
Citation
 Yang, WDrewe, JALan, NC Cloning and characterization of the human GABAA receptor alpha 4 subunit: identification of a unique diazepam-insensitive binding site. Eur J Pharmacol 291:319-25 (1995)  
Target
Name:
Gamma-aminobutyric acid receptor subunit alpha-4
Synonyms:
GABA A Alpha4Beta2Gamma2 GABA A Alpha4Gamma2 GABA receptor alpha-4 subunit GABRA4 Gamma-aminobutyric acid receptor subunit alpha-4
Type:
Enzyme Catalytic Domain
Mol. Mass.:
61648.70
Organism:
Homo sapiens (Human)
Description:
GABA A Alpha4Beta2Gamma2 0 HUMAN::P48169
Residue:
554
  
Inhibitor
Name:
BDBM50017320
Synonyms:
8-Bromo-7-oxo-3b,4,5,6-tetrahydro-7H-2,6a,11b-triaza-benzo[g]cyclopenta[e]azulene-3-carboxylic acid tert-butyl ester CHEMBL444045 | Ro-16-6028
Type:
Small organic molecule
Emp. Form.:
C19H20BrN3O3
Mol. Mass.:
418.284
SMILES:
CC(C)(C)OC(=O)c1ncn-2c1C1CCCN1C(=O)c1c(Br)cccc-21
: