Target
Gamma-aminobutyric acid receptor subunit alpha-4
Ligand
BDBM84957
Substrate
Ki
35.58±n/a nM
Comments
PDSP_504
Citation
 Yang, WDrewe, JALan, NC Cloning and characterization of the human GABAA receptor alpha 4 subunit: identification of a unique diazepam-insensitive binding site. Eur J Pharmacol 291:319-25 (1995)  
Target
Name:
Gamma-aminobutyric acid receptor subunit alpha-4
Synonyms:
GABA A Alpha4Beta2Gamma2 GABA A Alpha4Gamma2 GABA receptor alpha-4 subunit GABRA4 Gamma-aminobutyric acid receptor subunit alpha-4
Type:
Enzyme Catalytic Domain
Mol. Mass.:
61648.70
Organism:
Homo sapiens (Human)
Description:
GABA A Alpha4Beta2Gamma2 0 HUMAN::P48169
Residue:
554
  
Inhibitor
Name:
BDBM84957
Synonyms:
CGS 9896 | CHEMBL20042
Type:
Small organic molecule
Emp. Form.:
C16H10ClN3O
Mol. Mass.:
295.723
SMILES:
Clc1ccc(cc1)-n1[nH]c2c(cnc3ccccc23)c1=O
: