Target
Gamma-aminobutyric acid receptor subunit alpha-4
Ligand
BDBM81951
Substrate
Ki
14.06±n/a nM
Comments
PDSP_689
Citation
 Yang, WDrewe, JALan, NC Cloning and characterization of the human GABAA receptor alpha 4 subunit: identification of a unique diazepam-insensitive binding site. Eur J Pharmacol 291:319-25 (1995)  
Target
Name:
Gamma-aminobutyric acid receptor subunit alpha-4
Synonyms:
GABA A Alpha4Beta2Gamma2 GABA A Alpha4Gamma2 GABA receptor alpha-4 subunit GABRA4 Gamma-aminobutyric acid receptor subunit alpha-4
Type:
Enzyme Catalytic Domain
Mol. Mass.:
61648.70
Organism:
Homo sapiens (Human)
Description:
GABA A Alpha4Beta2Gamma2 0 HUMAN::P48169
Residue:
554
  
Inhibitor
Name:
BDBM81951
Synonyms:
CAS_104999 NSC_104999
Type:
Small organic molecule
Emp. Form.:
C17H18N2O4
Mol. Mass.:
314.3358
SMILES:
CCc1c(ncc2[nH]c3cc(OC)c(OC)cc3c12)C(=O)OC
: