Target
Gamma-aminobutyric acid receptor subunit alpha-4
Ligand
BDBM84955
Substrate
Ki
299.84±n/a nM
Comments
PDSP_820
Citation
 Yang, WDrewe, JALan, NC Cloning and characterization of the human GABAA receptor alpha 4 subunit: identification of a unique diazepam-insensitive binding site. Eur J Pharmacol 291:319-25 (1995)  
Target
Name:
Gamma-aminobutyric acid receptor subunit alpha-4
Synonyms:
GABA A Alpha4Beta2Gamma2 GABA A Alpha4Gamma2 GABA receptor alpha-4 subunit GABRA4 Gamma-aminobutyric acid receptor subunit alpha-4
Type:
Enzyme Catalytic Domain
Mol. Mass.:
61648.70
Organism:
Homo sapiens (Human)
Description:
GABA A Alpha4Beta2Gamma2 0 HUMAN::P48169
Residue:
554
  
Inhibitor
Name:
BDBM84955
Synonyms:
CAS_4375 NSC_4375
Type:
Small organic molecule
Emp. Form.:
C13H11N3O
Mol. Mass.:
225.2459
SMILES:
CNC(=O)c1cc2c(cn1)[nH]c1ccccc21
: