Target
Histamine H1 receptor
Ligand
BDBM84991
Substrate
Ki
>10000±n/a nM
Comments
PDSP_1673
Citation
 Baxter, GS Novel discriminatory ligands for 5-HT2B receptors. Behav Brain Res 73:149-52 (1996)  
Target
Name:
Histamine H1 receptor
Synonyms:
HISTAMINE H1 HRH1_CAVPO
Type:
G Protein-Coupled Receptor (GPCR)
Mol. Mass.:
55641.53
Organism:
Cavia porcellus (domestic guinea pig)
Description:
Guinea pig cerebellum was used in binding assay.
Residue:
488
  
Inhibitor
Name:
BDBM84991
Synonyms:
CAS_3277600 SB204741
Type:
Small organic molecule
Emp. Form.:
C14H14N4OS
Mol. Mass.:
286.352
SMILES:
Cc1cc(NC(=O)Nc2ccc3n(C)ccc3c2)sn1
: