Target
Gamma-aminobutyric acid receptor subunit alpha-4
Ligand
BDBM50244033
Substrate
Ki
1060±n/a nM
Comments
PDSP_221
Citation
 Scholze, PEbert, VSieghart, W Affinity of various ligands for GABAA receptors containing alpha 4 beta 3 gamma 2, alpha 4 gamma 2, or alpha 1 beta 3 gamma 2 subunits. Eur J Pharmacol 304:155-62 (1996)  
Target
Name:
Gamma-aminobutyric acid receptor subunit alpha-4
Synonyms:
GABA A Alpha4Beta2Gamma2 GABA A Alpha4Gamma2 GABA receptor alpha-4 subunit GABRA4 Gamma-aminobutyric acid receptor subunit alpha-4
Type:
Enzyme Catalytic Domain
Mol. Mass.:
61648.70
Organism:
Homo sapiens (Human)
Description:
GABA A Alpha4Beta2Gamma2 0 HUMAN::P48169
Residue:
554
  
Inhibitor
Name:
BDBM50244033
Synonyms:
Abecarnil isopropyl 6-(benzyloxy)-4-(methoxymethyl)-9H-pyrido[3,4-b]indole-3-carboxylate
Type:
Small organic molecule
Emp. Form.:
C24H24N2O4
Mol. Mass.:
404.4584
SMILES:
COCc1c(ncc2[nH]c3ccc(OCc4ccccc4)cc3c12)C(=O)OC(C)C
: