Target
Gamma-aminobutyric acid receptor subunit alpha-4
Ligand
BDBM84992
Substrate
Ki
922±n/a nM
Comments
PDSP_352
Citation
 Scholze, PEbert, VSieghart, W Affinity of various ligands for GABAA receptors containing alpha 4 beta 3 gamma 2, alpha 4 gamma 2, or alpha 1 beta 3 gamma 2 subunits. Eur J Pharmacol 304:155-62 (1996)  
Target
Name:
Gamma-aminobutyric acid receptor subunit alpha-4
Synonyms:
GABA A Alpha4Beta2Gamma2 GABA A Alpha4Gamma2 GABA receptor alpha-4 subunit GABRA4 Gamma-aminobutyric acid receptor subunit alpha-4
Type:
Enzyme Catalytic Domain
Mol. Mass.:
61648.70
Organism:
Homo sapiens (Human)
Description:
GABA A Alpha4Beta2Gamma2 0 HUMAN::P48169
Residue:
554
  
Inhibitor
Name:
BDBM84992
Synonyms:
Beta CCP NSC_123662
Type:
Small organic molecule
Emp. Form.:
C15H14N2O2
Mol. Mass.:
254.2839
SMILES:
CCCOC(=O)c1cc2c(cn1)[nH]c1ccccc21
: