Target
Gamma-aminobutyric acid receptor subunit alpha-4
Ligand
BDBM50017009
Substrate
Ki
11.9±n/a nM
Comments
PDSP_502
Citation
 Scholze, PEbert, VSieghart, W Affinity of various ligands for GABAA receptors containing alpha 4 beta 3 gamma 2, alpha 4 gamma 2, or alpha 1 beta 3 gamma 2 subunits. Eur J Pharmacol 304:155-62 (1996)  
Target
Name:
Gamma-aminobutyric acid receptor subunit alpha-4
Synonyms:
GABA A Alpha4Beta2Gamma2 GABA A Alpha4Gamma2 GABA receptor alpha-4 subunit GABRA4 Gamma-aminobutyric acid receptor subunit alpha-4
Type:
Enzyme Catalytic Domain
Mol. Mass.:
61648.70
Organism:
Homo sapiens (Human)
Description:
GABA A Alpha4Beta2Gamma2 0 HUMAN::P48169
Residue:
554
  
Inhibitor
Name:
BDBM50017009
Synonyms:
2-Phenyl-2,3a-dihydro-pyrazolo[4,3-c]quinolin-3-one(CGS 8216) 2-Phenyl-2,5-dihydro-pyrazolo[4,3-c]quinolin-3-one (CGS 8216) 2-Phenyl-2,5-dihydro-pyrazolo[4,3-c]quinolin-3-one(CGS-8216) CGS 8216, 1 CHEMBL19732
Type:
Small organic molecule
Emp. Form.:
C16H11N3O
Mol. Mass.:
261.278
SMILES:
O=c1n([nH]c2c1cnc1ccccc21)-c1ccccc1
: