Target
Gamma-aminobutyric acid receptor subunit alpha-4
Ligand
BDBM84957
Substrate
Ki
59±n/a nM
Comments
PDSP_504
Citation
 Scholze, PEbert, VSieghart, W Affinity of various ligands for GABAA receptors containing alpha 4 beta 3 gamma 2, alpha 4 gamma 2, or alpha 1 beta 3 gamma 2 subunits. Eur J Pharmacol 304:155-62 (1996)  
Target
Name:
Gamma-aminobutyric acid receptor subunit alpha-4
Synonyms:
GABA A Alpha4Beta2Gamma2 GABA A Alpha4Gamma2 GABA receptor alpha-4 subunit GABRA4 Gamma-aminobutyric acid receptor subunit alpha-4
Type:
Enzyme Catalytic Domain
Mol. Mass.:
61648.70
Organism:
Homo sapiens (Human)
Description:
GABA A Alpha4Beta2Gamma2 0 HUMAN::P48169
Residue:
554
  
Inhibitor
Name:
BDBM84957
Synonyms:
CGS 9896 | CHEMBL20042
Type:
Small organic molecule
Emp. Form.:
C16H10ClN3O
Mol. Mass.:
295.723
SMILES:
Clc1ccc(cc1)-n1[nH]c2c(cnc3ccccc23)c1=O
: