Target
5-hydroxytryptamine 1D receptor
Ligand
BDBM50026045
Substrate
Ki
6150±n/a nM
Comments
PDSP_1593
Citation
 Bymaster, FPCalligaro, DOFalcone, JFMarsh, RDMoore, NATye, NCSeeman, PWong, DT Radioreceptor binding profile of the atypical antipsychotic olanzapine. Neuropsychopharmacology 14:87-96 (1996)  
Target
Name:
5-hydroxytryptamine 1D receptor
Synonyms:
5-hydroxytryptamine 1D receptor (5HT1D) | HTR1D
Type:
Protein
Mol. Mass.:
12731.52
Organism:
Bos taurus (Bovine)
Description:
Q8MI13
Residue:
119
  
Inhibitor
Name:
BDBM50026045
Synonyms:
(R,S)-3-Bromo-N-(1-ethyl-pyrrolidin-2-ylmethyl)-2,6-dimethoxy-benzamide 3-Bromo-N-((R)-1-ethyl-pyrrolidin-2-ylmethyl)-2,6-dimethoxy-benzamide 3-Bromo-N-(1-ethyl-pyrrolidin-2-ylmethyl)-2,6-dimethoxy-benzamide 3-Bromo-N-(1-ethyl-pyrrolidin-2-ylmethyl)-2,6-dimethoxy-benzamide(remoxipride) REMOXIPRIDE
Type:
Small organic molecule
Emp. Form.:
C16H23BrN2O3
Mol. Mass.:
371.269
SMILES:
CCN1CCC[C@H]1CNC(=O)c1c(OC)ccc(Br)c1OC
: