Target
Metabotropic glutamate receptor 2
Ligand
BDBM50030628
Substrate
Ki
>10000±n/a nM
Comments
PDSP_3723
Citation
 Gomeza, JMary, SBrabet, IParmentier, MLRestituito, SBockaert, JPin, JP Coupling of metabotropic glutamate receptors 2 and 4 to G alpha 15, G alpha 16, and chimeric G alpha q/i proteins: characterization of new antagonists. Mol Pharmacol 50:923-30 (1996) Target
Name:
Metabotropic glutamate receptor 2
Synonyms:
GPRC1B GRM2_HUMAN Metabotropic glutamate receptor mGlu2 | metabotropic glutamate 2
Type:
Enzyme
Mol. Mass.:
95584.88
Organism:
Homo sapiens (Human)
Description:
Q14416
Residue:
872
  
Inhibitor
Name:
BDBM50030628
Synonyms:
(S)-4C3HPG 4-(Amino-carboxy-methyl)-2-hydroxy-benzoic acid(S-4C3HPG) CHEMBL444589
Type:
Small organic molecule
Emp. Form.:
C9H9NO5
Mol. Mass.:
211.1715
SMILES:
NC(C(O)=O)c1ccc(C(O)=O)c(O)c1
: