Target
5-hydroxytryptamine receptor 4
Ligand
BDBM50007872
Substrate
Ki
15.84±n/a nM
Comments
PDSP_399
Citation
 Ansanay, HSebben, MBockaert, JDumuis, A Pharmacological comparison between [3H]GR 113808 binding sites and functional 5-HT4 receptors in neurons. Eur J Pharmacol 298:165-74 (1996)  
Target
Name:
5-hydroxytryptamine receptor 4
Synonyms:
5-HT4 5HT4R_CAVPO Serotonin 4 (5-HT4) receptor
Type:
Enzyme Catalytic Domain
Mol. Mass.:
43735.29
Organism:
GUINEA PIG
Description:
5-HT4 HTR4 GUINEA PIG::O70528
Residue:
388
  
Inhibitor
Name:
BDBM50007872
Synonyms:
3-Ethyl-2-oxo-2,3-dihydro-benzoimidazole-1-carboxylic acid (8-methyl-8-aza-bicyclo[3.2.1]oct-3-yl)-amide; hydrochloride CHEMBL544755 | CHEMBL62023
Type:
Small organic molecule
Emp. Form.:
C18H24N4O2
Mol. Mass.:
328.4088
SMILES:
CCn1c2ccccc2n(C(=O)NC2CC3CCC(C2)N3C)c1=O
: