Target
Diacylglycerol O-acyltransferase 2
Ligand
BDBM274962
Substrate
Meas. Tech.
Enzymatic Activity Assay
pH
7±n/a
Temperature
298.15±n/a K
IC50
104±n/a nM
Comments
extracted
Citation
 Imbriglio, JLondon, CLu, ZTata, JXiong, YYou, MYoum, H Tetrahydroisoquinoline derivatives useful as inhibitors of diacylglyceride O-acyltransferase 2 US Patent  US9877957 Publication Date 1/30/2018 
Target
Name:
Diacylglycerol O-acyltransferase 2
Synonyms:
ARAT DGAT2 Diacylglycerol O-acyltransferase 2 (DGAT2) Retinol O-fatty-acyltransferase
Type:
Multi-pass membrane protein
Mol. Mass.:
43848.90
Organism:
Homo sapiens (Human)
Description:
Q96PD7
Residue:
388
  
Inhibitor
Name:
BDBM274962
Synonyms:
N-(tert-butyl)-5-(3- (trifluoromethoxy)phenyl)-8-((3- (trifluoromethyl)-1H-pyrazole-5- carboxamido)methyl)-3,4- dihydroisoquinoline-2(1H)-carboxamide | US9877957, Example 2
Type:
Small organic molecule
Emp. Form.:
C27H27F6N5O3
Mol. Mass.:
583.5254
SMILES:
CC(C)(C)NC(=O)N1CCc2c(C1)c(CNC(=O)c1cc(n[nH]1)C(F)(F)F)ccc2-c1cccc(OC(F)(F)F)c1
: