Target
Diacylglycerol O-acyltransferase 2
Ligand
BDBM274964
Substrate
Meas. Tech.
Enzymatic Activity Assay
pH
7±n/a
Temperature
298.15±n/a K
IC50
41.4±n/a nM
Comments
extracted
Citation
 Imbriglio, JLondon, CLu, ZTata, JXiong, YYou, MYoum, H Tetrahydroisoquinoline derivatives useful as inhibitors of diacylglyceride O-acyltransferase 2 US Patent  US9877957 Publication Date 1/30/2018 
Target
Name:
Diacylglycerol O-acyltransferase 2
Synonyms:
ARAT DGAT2 Diacylglycerol O-acyltransferase 2 (DGAT2) Retinol O-fatty-acyltransferase
Type:
Multi-pass membrane protein
Mol. Mass.:
43848.90
Organism:
Homo sapiens (Human)
Description:
Q96PD7
Residue:
388
  
Inhibitor
Name:
BDBM274964
Synonyms:
N-(tert-butyl)-5-(3-methoxyphenyl)-8- ((3-(trifluoromethyl)-1H-pyrazole-5- carboxamido)methyl)-3,4- dihydroisoquinoline-2(1H)-carboxamide | US9877957, Example 4
Type:
Small organic molecule
Emp. Form.:
C27H30F3N5O3
Mol. Mass.:
529.554
SMILES:
COc1cccc(c1)-c1ccc(CNC(=O)c2cc(n[nH]2)C(F)(F)F)c2CN(CCc12)C(=O)NC(C)(C)C
: