Target
Diacylglycerol O-acyltransferase 2
Ligand
BDBM274965
Substrate
Meas. Tech.
Enzymatic Activity Assay
pH
7±n/a
Temperature
298.15±n/a K
IC50
135±n/a nM
Comments
extracted
Citation
 Imbriglio, JLondon, CLu, ZTata, JXiong, YYou, MYoum, H Tetrahydroisoquinoline derivatives useful as inhibitors of diacylglyceride O-acyltransferase 2 US Patent  US9877957 Publication Date 1/30/2018 
Target
Name:
Diacylglycerol O-acyltransferase 2
Synonyms:
ARAT DGAT2 Diacylglycerol O-acyltransferase 2 (DGAT2) Retinol O-fatty-acyltransferase
Type:
Multi-pass membrane protein
Mol. Mass.:
43848.90
Organism:
Homo sapiens (Human)
Description:
Q96PD7
Residue:
388
  
Inhibitor
Name:
BDBM274965
Synonyms:
N-((2-(tert-butylcarbamoyl)-5-(3- methoxyphenyl)-1,2,3,4- tetrahydroisoquinolin-8- yl)methyl)isoquinoline-1-carboxamide | US9877957, Example 5
Type:
Small organic molecule
Emp. Form.:
C32H34N4O3
Mol. Mass.:
522.6374
SMILES:
COc1cccc(c1)-c1ccc(CNC(=O)c2nccc3ccccc23)c2CN(CCc12)C(=O)NC(C)(C)C
: