Target
Diacylglycerol O-acyltransferase 2
Ligand
BDBM274984
Substrate
Meas. Tech.
Enzymatic Activity Assay
pH
7±n/a
Temperature
298.15±n/a K
IC50
244±n/a nM
Comments
extracted
Citation
 Imbriglio, JLondon, CLu, ZTata, JXiong, YYou, MYoum, H Tetrahydroisoquinoline derivatives useful as inhibitors of diacylglyceride O-acyltransferase 2 US Patent  US9877957 Publication Date 1/30/2018 
Target
Name:
Diacylglycerol O-acyltransferase 2
Synonyms:
ARAT DGAT2 Diacylglycerol O-acyltransferase 2 (DGAT2) Retinol O-fatty-acyltransferase
Type:
Multi-pass membrane protein
Mol. Mass.:
43848.90
Organism:
Homo sapiens (Human)
Description:
Q96PD7
Residue:
388
  
Inhibitor
Name:
BDBM274984
Synonyms:
N2-(tert-butyl)-N8-(2-(imidazo[1,2-a]pyridin- 2-yl)ethyl)-5-(3-(trifluoromethyl)phenyl)- 3,4-dihydroisoquinoline-2,8(1H)- dicarboxamide | US9877957, Example 23
Type:
Small organic molecule
Emp. Form.:
C31H32F3N5O2
Mol. Mass.:
563.6133
SMILES:
CC(C)(C)NC(=O)N1CCc2c(C1)c(ccc2-c1cccc(c1)C(F)(F)F)C(=O)NCCc1cn2ccccc2n1
: