Target
Diacylglycerol O-acyltransferase 2
Ligand
BDBM274998
Substrate
Meas. Tech.
Enzymatic Activity Assay
pH
7±n/a
Temperature
298.15±n/a K
IC50
739±n/a nM
Comments
extracted
Citation
 Imbriglio, JLondon, CLu, ZTata, JXiong, YYou, MYoum, H Tetrahydroisoquinoline derivatives useful as inhibitors of diacylglyceride O-acyltransferase 2 US Patent  US9877957 Publication Date 1/30/2018 
Target
Name:
Diacylglycerol O-acyltransferase 2
Synonyms:
ARAT DGAT2 Diacylglycerol O-acyltransferase 2 (DGAT2) Retinol O-fatty-acyltransferase
Type:
Multi-pass membrane protein
Mol. Mass.:
43848.90
Organism:
Homo sapiens (Human)
Description:
Q96PD7
Residue:
388
  
Inhibitor
Name:
BDBM274998
Synonyms:
N2-(tert-butyl)-N8-(2-(5-phenyl-1H-1,2,3- triazol-1-yl)ethyl)-5-(3- (trifluoromethyl)phenyl)-3,4- dihydroisoquinoline-2,8(1H)-dicarboxamide | US9877957, Example 37
Type:
Small organic molecule
Emp. Form.:
C32H33F3N6O2
Mol. Mass.:
590.6386
SMILES:
CC(C)(C)NC(=O)N1CCc2c(C1)c(ccc2-c1cccc(c1)C(F)(F)F)C(=O)NCCn1nncc1-c1ccccc1
: