Target
Diacylglycerol O-acyltransferase 2
Ligand
BDBM275030
Substrate
Meas. Tech.
Enzymatic Activity Assay
pH
7±n/a
Temperature
298.15±n/a K
IC50
474±n/a nM
Comments
extracted
Citation
 Imbriglio, JLondon, CLu, ZTata, JXiong, YYou, MYoum, H Tetrahydroisoquinoline derivatives useful as inhibitors of diacylglyceride O-acyltransferase 2 US Patent  US9877957 Publication Date 1/30/2018 
Target
Name:
Diacylglycerol O-acyltransferase 2
Synonyms:
ARAT DGAT2 Diacylglycerol O-acyltransferase 2 (DGAT2) Retinol O-fatty-acyltransferase
Type:
Multi-pass membrane protein
Mol. Mass.:
43848.90
Organism:
Homo sapiens (Human)
Description:
Q96PD7
Residue:
388
  
Inhibitor
Name:
BDBM275030
Synonyms:
N2-(tert-butyl)-N8-((1-methyl-1H-imidazol- 2-yl)methyl)-5-(3-(trifluoromethyl)phenyl)- 3,4-dihydroisoquinoline-2,8(1H)- dicarboxamide | US9877957, Example 68
Type:
Small organic molecule
Emp. Form.:
C27H30F3N5O2
Mol. Mass.:
513.5546
SMILES:
Cn1ccnc1CNC(=O)c1ccc(-c2cccc(c2)C(F)(F)F)c2CCN(Cc12)C(=O)NC(C)(C)C
: