Target
Diacylglycerol O-acyltransferase 2
Ligand
BDBM275033
Substrate
Meas. Tech.
Enzymatic Activity Assay
pH
7±n/a
Temperature
298.15±n/a K
IC50
178±n/a nM
Comments
extracted
Citation
 Imbriglio, JLondon, CLu, ZTata, JXiong, YYou, MYoum, H Tetrahydroisoquinoline derivatives useful as inhibitors of diacylglyceride O-acyltransferase 2 US Patent  US9877957 Publication Date 1/30/2018 
Target
Name:
Diacylglycerol O-acyltransferase 2
Synonyms:
ARAT DGAT2 Diacylglycerol O-acyltransferase 2 (DGAT2) Retinol O-fatty-acyltransferase
Type:
Multi-pass membrane protein
Mol. Mass.:
43848.90
Organism:
Homo sapiens (Human)
Description:
Q96PD7
Residue:
388
  
Inhibitor
Name:
BDBM275033
Synonyms:
N8-(2-(4H-1,2,4-triazol-4-yl)ethyl)-N2-(tert- butyl)-5-(3-(trifluoromethyl)phenyl)-3,4- dihydroisoquinoline-2,8(1H)-dicarboxamide | US9877957, Example 71
Type:
Small organic molecule
Emp. Form.:
C26H29F3N6O2
Mol. Mass.:
514.5427
SMILES:
CC(C)(C)NC(=O)N1CCc2c(C1)c(ccc2-c1cccc(c1)C(F)(F)F)C(=O)NCCn1cnnc1
: