Target
Diacylglycerol O-acyltransferase 2
Ligand
BDBM275041
Substrate
Meas. Tech.
Enzymatic Activity Assay
pH
7±n/a
Temperature
298.15±n/a K
IC50
149±n/a nM
Comments
extracted
Citation
 Imbriglio, JLondon, CLu, ZTata, JXiong, YYou, MYoum, H Tetrahydroisoquinoline derivatives useful as inhibitors of diacylglyceride O-acyltransferase 2 US Patent  US9877957 Publication Date 1/30/2018 
Target
Name:
Diacylglycerol O-acyltransferase 2
Synonyms:
ARAT DGAT2 Diacylglycerol O-acyltransferase 2 (DGAT2) Retinol O-fatty-acyltransferase
Type:
Multi-pass membrane protein
Mol. Mass.:
43848.90
Organism:
Homo sapiens (Human)
Description:
Q96PD7
Residue:
388
  
Inhibitor
Name:
BDBM275041
Synonyms:
N2-(tert-butyl)-N8-(pyrazolo[1,5-a]pyridin-7- ylmethyl)-5-(3-(trifluoromethoxy)phenyl)- 3,4-dihydroisoquinoline-2,8(1H)- dicarboxamide | US9877957, Example 79
Type:
Small organic molecule
Emp. Form.:
C30H30F3N5O3
Mol. Mass.:
565.5861
SMILES:
CC(C)(C)NC(=O)N1CCc2c(C1)c(ccc2-c1cccc(OC(F)(F)F)c1)C(=O)NCc1cccc2ccnn12
: