Target
Neuropeptide Y receptor type 2
Ligand
BDBM82282
Substrate
Ki
5±n/a nM
Comments
PDSP_1382
Citation
 Matsumoto, MNomura, TMomose, KIkeda, YKondou, YAkiho, HTogami, JKimura, YOkada, MYamaguchi, T Inactivation of a novel neuropeptide Y/peptide YY receptor gene in primate species. J Biol Chem 271:27217-20 (1996)  
Target
Name:
Neuropeptide Y receptor type 2
Synonyms:
NPY-Y2 Neuropeptide Y receptor Y2
Type:
Enzyme Catalytic Domain
Mol. Mass.:
42919.43
Organism:
RABBIT
Description:
B6VRS5
Residue:
382
  
Inhibitor
Name:
BDBM82282
Synonyms:
NPY13-36 | NPY13-36, porcine
Type:
Small organic molecule
Emp. Form.:
C135H209N41O36
Mol. Mass.:
2982.3571
SMILES:
CC[C@H](C)[C@H](NC(=O)[C@H](Cc1ccc(O)cc1)NC(=O)[C@H](Cc1cnc[nH]1)NC(=O)[C@H](CCCN=C(N)N)NC(=O)[C@H](CC(C)C)NC(=O)[C@H](C)NC(=O)[C@H](CO)NC(=O)[C@H](Cc1ccc(O)cc1)NC(=O)[C@H](Cc1ccc(O)cc1)NC(=O)[C@H](CCCN=C(N)N)NC(=O)[C@H](C)NC(=O)[C@H](CC(C)C)NC(=O)[C@H](CC(O)=O)NC(=O)[C@H](CCC(O)=O)NC(=O)[C@H](C)NC(=O)[C@@H]1CCCN1)C(=O)N[C@@H](CC(N)=O)C(=O)N[C@@H](CC(C)C)C(=O)N[C@@H]([C@@H](C)CC)C(=O)N[C@@H]([C@@H](C)O)C(=O)N[C@@H](CCCN=C(N)N)C(=O)N[C@@H](CCC(N)=O)C(=O)N[C@@H](CCCN=C(N)N)C(=O)N[C@@H](Cc1ccc(O)cc1)C(N)=O
: