Target
Gamma-aminobutyric acid receptor subunit alpha-1
Ligand
BDBM85031
Substrate
Ki
350±n/a nM
Comments
PDSP_1423
Citation
 Hoogerkamp, AArends, RHBomers, AMMandema, JWVoskuyl, RADanhof, M Pharmacokinetic/pharmacodynamic relationship of benzodiazepines in the direct cortical stimulation model of anticonvulsant effect. J Pharmacol Exp Ther 279:803-12 (1996) Target
Name:
Gamma-aminobutyric acid receptor subunit alpha-1
Synonyms:
Benzodiazepine central GABA A Benzodiazepine GABA A Benzodiazepine Type II GABA A Benzodiazepine Type IIM GABA A Benzodiazepine omega2 GABA A alpha1 GABA receptor alpha-1 subunit GABA-PICROTOXIN Gabra-1 TBPS
Type:
Enzyme
Mol. Mass.:
51770.21
Organism:
Rattus norvegicus (Rat)
Description:
P62813
Residue:
455
  
Inhibitor
Name:
BDBM85031
Synonyms:
CAS_604-75-1 Oxazepam
Type:
Small organic molecule
Emp. Form.:
C15H11ClN2O2
Mol. Mass.:
286.713
SMILES:
OC1N=C(c2ccccc2)c2cc(Cl)ccc2NC1=O
: