Target
Protachykinin-1
Ligand
BDBM81483
Substrate
Ki
1000±n/a nM
Comments
PDSP_1499
Citation
 Schotte, AJanssen, PFGommeren, WLuyten, WHVan Gompel, PLesage, ASDe Loore, KLeysen, JE Risperidone compared with new and reference antipsychotic drugs: in vitro and in vivo receptor binding. Psychopharmacology (Berl) 124:57-73 (1996)  
Target
Name:
Protachykinin-1
Synonyms:
NKA Protachykinin-1 TAC1 TKN1_HUMAN
Type:
Enzyme Catalytic Domain
Mol. Mass.:
15006.99
Organism:
Homo sapiens (Human)
Description:
Substance P 0 HUMAN::P20366
Residue:
129
  
Inhibitor
Name:
BDBM81483
Synonyms:
CAS_1893-33-0 PIPAMPERONE
Type:
Small organic molecule
Emp. Form.:
C21H30FN3O2
Mol. Mass.:
375.4802
SMILES:
NC(=O)C1(CCN(CCCC(=O)c2ccc(F)cc2)CC1)N1CCCCC1
: