Target
Gamma-aminobutyric acid receptor subunit alpha-4
Ligand
BDBM50243981
Substrate
Ki
436±n/a nM
Comments
PDSP_351
Citation
 Gunnersen, DKaufman, CMSkolnick, P Pharmacological properties of recombinant "diazepam-insensitive" GABAA receptors. Neuropharmacology 35:1307-14 (1996)  
Target
Name:
Gamma-aminobutyric acid receptor subunit alpha-4
Synonyms:
GBRA4_RAT Gamma-aminobutyric acid receptor (GABA(A)) subunit alpha-4
Type:
Enzyme
Mol. Mass.:
60972.37
Organism:
Rattus norvegicus (Rat)
Description:
P28471
Residue:
552
  
Inhibitor
Name:
BDBM50243981
Synonyms:
Beta CCM Methyl Beta-carboline-3 carboxylate | methyl 9H-pyrido[3,4-b]indole-3-carboxylate
Type:
Small organic molecule
Emp. Form.:
C13H10N2O2
Mol. Mass.:
226.2307
SMILES:
COC(=O)c1cc2c(cn1)[nH]c1ccccc21
: