Target
Gamma-aminobutyric acid receptor subunit alpha-4
Ligand
BDBM84957
Substrate
Ki
214±n/a nM
Comments
PDSP_504
Citation
 Gunnersen, DKaufman, CMSkolnick, P Pharmacological properties of recombinant "diazepam-insensitive" GABAA receptors. Neuropharmacology 35:1307-14 (1996)  
Target
Name:
Gamma-aminobutyric acid receptor subunit alpha-4
Synonyms:
GBRA4_RAT Gamma-aminobutyric acid receptor (GABA(A)) subunit alpha-4
Type:
Enzyme
Mol. Mass.:
60972.37
Organism:
Rattus norvegicus (Rat)
Description:
P28471
Residue:
552
  
Inhibitor
Name:
BDBM84957
Synonyms:
CGS 9896 | CHEMBL20042
Type:
Small organic molecule
Emp. Form.:
C16H10ClN3O
Mol. Mass.:
295.723
SMILES:
Clc1ccc(cc1)-n1[nH]c2c(cnc3ccccc23)c1=O
: