Target
Gamma-aminobutyric acid receptor subunit alpha-4
Ligand
BDBM85041
Substrate
Ki
188±n/a nM
Comments
PDSP_684
Citation
 Gunnersen, DKaufman, CMSkolnick, P Pharmacological properties of recombinant "diazepam-insensitive" GABAA receptors. Neuropharmacology 35:1307-14 (1996)  
Target
Name:
Gamma-aminobutyric acid receptor subunit alpha-4
Synonyms:
GBRA4_RAT Gamma-aminobutyric acid receptor (GABA(A)) subunit alpha-4
Type:
Enzyme
Mol. Mass.:
60972.37
Organism:
Rattus norvegicus (Rat)
Description:
P28471
Residue:
552
  
Inhibitor
Name:
BDBM85041
Synonyms:
DM 236 | DM-236
Type:
Small organic molecule
Emp. Form.:
C24H25N3O4
Mol. Mass.:
419.473
SMILES:
CN1Cc2c(ncn2-c2ccc(OCc3ccccc3)cc2C1=O)C(=O)OC(C)(C)C
: